{"text_format":"1","workbook":"xlsx","n_sheets":11,"sheets":["Instructions","Step 1 Smoking Costs","Step 2 Dosing Guide","Step 3 Cost of NRT","Results","Product Offering","Conversation Guide","Case Studies","FAQ","About this Tool","Information"],"not_rendered":{"charts":6,"images":84,"macros":1,"external_links":0,"defined_names":7,"comments":0,"pivot_tables":0},"unopened":[],"bounds":{"document_bytes":16777216,"sheet_cells":100000,"rows_first":2000,"rows_last":500,"rows_between":2000,"halvings":0,"cell_chars":16384,"cell_head_chars":4096},"cells_cut":0,"cells_raw":0,"read":"whole","date_system":"1900"}

{"sheet":"Instructions","index":0,"n_rows":17,"n_cols":5,"rows_kept":17,"cut":false,"hidden":false,"merged":[[14,2,14,20],[13,2,13,18],[0,1,0,19],[1,2,2,13],[5,4,5,11],[7,4,7,11],[9,4,9,11],[10,4,10,9]]}
[null,"Smoking Cessation Cost Comparison Tool"]
[null,null,"A common misperception is that nicotine replacement therapy (NRT) is cost prohibitive versus the cost of cigarettes. This tool can help patients understand the relative cost of NRT in comparison to the money they are spending on cigarettes.\n\nNote: For smokers who average less than 5, or more than 25 cigarettes per day, the cost benefit of NRT may need to be calculated over a shorter/longer period of time."]
[]
[null,null,null,"How to use this tool"]
[]
[null,null,null,null,"Step 1. Fill in Cost of Cigarettes section based on patients habits. "]
[]
[null,null,null,null,"Step 2. Review and Discuss Dosing Guide to determine NRT plan"]
[]
[null,null,null,null,"Step 3. Fill in Cost of NRT section based on patient preferences"]
{"$rows_left_out":8}
{"sheet":"Step 1 Smoking Costs","index":1,"n_rows":26,"n_cols":5,"rows_kept":26,"cut":false,"hidden":false,"merged":[[8,1,8,2],[0,0,0,20],[5,1,5,2]]}
["Smoking Cessation Cost Comparison Tool"]
[]
[]
[null,"Step 1: Cost of Cigarettes"]
[]
[null,"Please fill in all light blue cells with patient information"]
[]
[null,"Number of cigarettes smoked per day"]
[null,"Cost per pack(s)/carton of cigarettes (tax included) "]
[null,null,"Patient unsure of costs",{"$f":"IF(D9=\"\",VLOOKUP(C10,Information!A2:C13,2,FALSE),D9)","v":0},"*"]
{"$rows_left_out":17}
{"sheet":"Step 2 Dosing Guide","index":2,"n_rows":29,"n_cols":17,"rows_kept":29,"cut":false,"hidden":false,"merged":[[0,0,0,15],[2,2,2,5],[2,8,2,11],[5,1,5,9],[15,13,15,16],[10,3,10,6],[12,3,12,6],[16,1,17,4],[1,5,1,11],[6,1,6,8],[1,1,1,4],[25,7,26,7],[25,8,26,8],[25,9,26,9],[23,1,24,1],[23,2,24,2],[23,3,24,3],[23,5,24,5],[23,6,24,6],[25,1,26,1],[25,2,26,2],[25,3,26,3],[25,5,26,5],[25,6,26,6],[23,7,24,7],[23,8,24,8],[23,9,24,9]]}
["       Combination Therapy: Patch + Another Form of NRT"]
[]
[null,null,"Patch - Background nicotine substitution\nMaintains a constant, lower level of nicotine throughout the day. \n",null,null,null,null,null,"NRT - Fast relief for breakthrough craving\nSupplies additional levels of nicotine instead of a cigarette. "]
[]
[null,"Step 2: NICORETTE® and NICODERM® Combination Therapy Dosing Guide "]
[null,"\nThis dosing guide has been created to help you determine the NICORETTE® or NICODERM® (NRT) combination therapy products your patient might need while on their quit journey. \n\n\n\n"]
[null,"Follow the steps below and select the products on the right as you determine which product is suitable for your patients needs. "]
["A)","Choose your NICODERM® patch strength and use as directed. "]
[null,"Step 1: Recap"]
[null,"Number of cigarettes smoked per day",{"$f":"'Step 1 Smoking Costs'!D8","v":0}]
{"$rows_left_out":20}
{"sheet":"Step 3 Cost of NRT","index":3,"n_rows":48,"n_cols":8,"rows_kept":48,"cut":false,"hidden":false,"merged":[[0,0,0,23],[5,1,5,2],[4,1,4,21]]}
["Smoking Cessation Cost Comparison Tool"]
[]
[]
[null,"Step 3: Cost of Nicotine Replacement Therapy (NRT)"]
[null,"Based on information below from Steps 1 &2 select store preference and number of boxes required in table below. \nIf you expect your patient to use more than 12 weeks of therapy please note the cost of NRT will only be displayed within a 3 month window on the chart to the right. Cost totals will be correct to the information entered.  "]
[null,"Information from Steps 1 & 2",null,"Approx # of product required"]
[null,"Number of Cigarettes per day",{"$f":"'Step 1 Smoking Costs'!D8","v":0}]
[null,"NICODERM® Patch Step 1 - 21 mg",{"$f":"IF('Step 2 Dosing Guide'!O17=TRUE,\"Selected\",\"Not Selected\")","v":"Not Selected"},{"$f":"IF(C8=\"Selected\",'Step 2 Dosing Guide'!N17,\"0\")","v":"0"}]
[null,"NICODERM® Patch Step 2 - 14mg",{"$f":"IF('Step 2 Dosing Guide'!O18=TRUE,\"Selected\",\"Not Selected\")","v":"Not Selected"},{"$f":"IF(C9=\"Selected\",'Step 2 Dosing Guide'!N18,\"0\")","v":"0"}]
[null,"NICODERM® Patch Step 3 - 7mg",{"$f":"IF('Step 2 Dosing Guide'!O19=TRUE,\"Selected\",\"Not Selected\")","v":"Not Selected"},{"$f":"IF(C10=\"Selected\",'Step 2 Dosing Guide'!N19,\"0\")","v":"0"}]
{"$rows_left_out":39}
{"sheet":"Results","index":4,"n_rows":91,"n_cols":12,"rows_kept":91,"cut":false,"hidden":false,"merged":[[0,0,0,15],[89,1,89,12],[79,1,79,2],[65,1,65,2],[73,1,73,2],[79,7,79,13],[72,7,72,13],[21,3,21,14],[22,3,22,14],[23,3,23,14],[24,3,24,14],[25,3,25,14],[26,3,26,14],[27,3,27,14],[28,3,28,14],[29,3,29,14]]}
["Smoking Cessation Cost Comparison Tool"]
[null,"Results: Cost of Cigarettes"]
[]
[]
[]
[]
[null,"Daily Expense",{"$f":"'Step 1 Smoking Costs'!D14","v":{"$error":"#DIV/0!"}}]
[null,"Weekly Expense",{"$f":"'Step 1 Smoking Costs'!D15","v":{"$error":"#DIV/0!"}}]
[null,"Monthly Expense",{"$f":"'Step 1 Smoking Costs'!D16","v":{"$error":"#DIV/0!"}}]
[null,"Yearly Expense",{"$f":"'Step 1 Smoking Costs'!D17","v":{"$error":"#DIV/0!"}}]
{"$rows_left_out":82}
{"sheet":"Product Offering","index":5,"n_rows":16,"n_cols":9,"rows_kept":16,"cut":false,"hidden":false,"merged":[[11,6,12,6],[11,7,12,7],[9,2,10,2],[9,3,10,3],[9,4,10,4],[11,2,12,2],[11,3,12,3],[11,4,12,4],[5,2,6,5],[5,6,6,6],[0,0,0,8],[9,6,10,6],[9,7,10,7]]}
["Smoking Cessation Cost Comparison Tool"]
[]
[]
[]
[null,null,null,null,null,null,"How to use videos "]
[null,null,"NICODERM® Patch"]
[]
[]
[null,null,"Format","Characteristics/Attributes","Flavour","Strength ","Daily Maximum","How to use videos "]
[null,null,"NICORETTE® GUM","I want something that tastes great","Fresh Fruit\nULTRA fresh mint\nExtreme Chill®\nSpearmint\nCinnamon","2mg\n\nFor combination nicotine replacement therapy, use NICORETTE® 2mg gum if your time to first cigarette is >30 min after waking. ","20 Pieces"]
{"$rows_left_out":7}
{"sheet":"Conversation Guide","index":6,"n_rows":1,"n_cols":1,"rows_kept":1,"cut":false,"hidden":false,"merged":[[47,0,47,14],[0,0,0,13]]}
["Smoking Cessation Cost Comparison Tool"]

{"sheet":"Case Studies","index":7,"n_rows":10,"n_cols":3,"rows_kept":10,"cut":false,"hidden":false,"merged":[[7,2,7,3],[8,2,8,3],[9,2,9,3],[0,0,0,4],[4,2,4,3],[5,2,5,3],[6,2,6,3],[3,2,3,3],[1,1,2,3]]}
["Smoking Cessation Cost Comparison Tool"]
[null,"DIFFERENT QUITTERS\nWILL NEED\nDIFFERENT \nSUPPORT"]
[]
[null,"Case Study 1","Case Study 2"]
["Cigarettes Per Day ","9 per day ","20 per day"]
["Time to First Cigarette","> 30 minutes of waking","<30 Minutes of waking"]
["Background ","Female patient has been slowly reducing her cigarette use and is now only smoking 9 cigarettes per day down from 15. \nShe is now ready to quit completely. \nShe has been using the 2mg gum to reduce but has been stuck at 9 cigarettes for a number of weeks.","Male high school science teacher is ready to quit smoking abruptly. \nHe has tried unsuccessfully in the past. \nHas tried gum and lozenge in the past but unable to use during work hours. \nHe is looking for something that works quickly and is discreet. \nHe is motivated through tracking his progress."]
["Recommendation","Combination Nicotine Replacement Therapy Patch + Gum","Combination Nicotine Replacement Therapy Patch + QuickMist SmartTrack"]
["Patch Recommendation","Follow treatment recommendations for Patch <10 cigarettes per day","Follow treatment recommendations for Patch >10 cigarettes per day"]
["NICORETTE Recommendation","Follow treatment recommendations for 2 mg Gum (time to 1st cigarette >30 min of waking)","Follow treatment recommendations for QuickMist SmartTrack (up to 64 sprays per day)"]
{"$rows_left_out":1}
{"sheet":"FAQ","index":8,"n_rows":36,"n_cols":4,"rows_kept":36,"cut":false,"hidden":false,"merged":[[33,2,33,9],[35,2,35,9],[31,3,31,8],[13,3,13,9],[0,0,0,18],[3,3,3,9],[5,3,5,9],[7,3,7,9],[9,3,9,9],[11,3,11,9],[21,3,21,8],[25,3,25,8],[19,3,19,9]]}
["Smoking Cessation Cost Comparison Tool FAQ"]
[]
[null,null,"Q1","Why should I tell my patients to reduce their caffeine intake when starting their cessation journey?"]
[null,null,null,"Smoking increases the clearance of caffeine by about 50%. It is recommended advise your patient to reduce their caffeine intake by 50% to reduce the risk of caffeine related side effects like tremors and nausea.1 Switching to decaffeinated versions can also help.\n\n1.University of California San Francisco. Smoking Cessation Leadership center. Drug Interactions with Tobacco Smoke. "]
[null,null,"Q2","Is nicotine bad for you?"]
[null,null,null,"Some people worry that using Nicotine Replacement Therapy (NRT) to help them quit will be just as bad for their health as smoking cigarettes. It’s not true.\n\nIt’s cigarette smoke’s harmful chemicals, such as tar and carbon monoxide that are bad for you. Those ingredients can lead to health problems like heart disease and lung cancer.\n\nNicotine causes you to become addicted to smoking, and using NRT lets you reduce the cigarettes you smoke. By reducing the amount of tobacco smoke you inhale, you also reduce the associated health risks.\n\nhttps://www.nicorette.ca/get-ready-to-quit/myths-about-quitting-smoking"]
[null,null,"Q3","My patient only want to use willpower to quit."]
[null,null,null,"People who try quitting cold turkey have less chance of stopping smoking for good compared to people who use proven medications to reduce strong withdrawal symptoms. Quitting cold turkey can be especially hard because you’re dealing with the physical withdrawal symptoms at the same time as you’re kicking the habit. Instead, using medications like NICORETTE® have been  clinically proven to double your chances of successfully quitting smoking versus willpower alone.\n\nhttps://www.nicorette.ca/get-ready-to-quit/myths-about-quitting-smoking"]
[null,null,"Q4","What are the most common reasons for relapse when using NRT?"]
[null,null,null,"There are many reasons why quit attempts fail but from a nicotine replacement therapy (NRT) perspective, inadequate dosing and incorrect use is often at the heart of it. The good news is that intense nicotine withdrawal symptoms, which are the number one reason for relapse, can be very successfully mitigated through appropriate NRT dosing, usage guidance, and adherence to an appropriate treatment timeline.  This is where HCPs can play an important role - optimizing their patient medication regime. "]
{"$rows_left_out":27}
{"sheet":"About this Tool","index":9,"n_rows":8,"n_cols":6,"rows_kept":8,"cut":false,"hidden":false,"merged":[[0,0,0,16],[3,5,3,9],[5,5,5,9],[7,5,7,9],[4,3,4,4]]}
["About this Tool"]
[]
[null,null,null,"Heather Hadden B Sc Phm R Phm\nPrimary Care Pharmacist ",null,"This tool was authored by Heather Hadden B Sc Phm R Phm for Johnson & Johnson Consumer Health. "]
[null,null,null,null,null,"Heather Hadden has a wealth of experience as a hospital pharmacist and a primary health care team pharmacist. After gradating from the University of Toronto she completed a Hospital Pharmacy Residency at Women’s College Hospital where she continued to work for several years before joining the Credit Valley Hospital for almost 20 years. She has since worked in primary care for over 13 years first at The Credit Valley Family Health Team and more recently helped to implement CarePoint Health, an Inter-Professional Care Team (IPCT) in Mississauga She has certifications in smoking cessation (TEACH Certified; OMSC, STOP) , palliative care, CBT-insomnia, memory clinics, and osteoporosis, She is one of  the Ontario VP’s for Pharmacist for a Smoke Free Canada as well as a preceptor for the U of T 4th year APPE students, Pharm D for Pharmacist program, Hospital Residency program and a Coach and Mentor for Hospital and Primary Care Pharmacists at the Ontario College of Pharmacists. She is a University of Toronto Preceptor of the Year award recipient for Pharmacy students and most recently the 2021 University of Toronto Arbor Award recipient. She is a member and founder of a number of pharmacy and health profession associations. "]
[null,null,null,"Maeryl Sumagang\nDoctor of Pharmacy (PharmD) Candidate",null,"This tool was developed through support by Maeryl Sumagang for Johnson & Johnson Consumer Health. "]
[null,null,null,null,null,"Maeryl Sumagang completed her Bachelors degree in pharmacology and global health in 2018 and is completing her Doctor of Pharmacy (PharmD) degree and Certificate in Global Studies in Pharmacy from the University of Toronto in 2022. Aside from her love for pediatric practice, she has a strong interest in global health with the goal of providing patient-centered care to marginalized individuals and those of lower socioeconomic status both locally and on a global scale. After she graduates, she is pursuing her hospital residency at the Hospital for Sick Children in Toronto, Ontario. "]
[null,null,null,"Chris Oliveiro Pharm.D. R.Ph. CDE\nRetail Pharmacist",null,"This tool was reviewed by Chris Oliveiro for Johnson & Johnson Consumer Health. "]
[null,null,null,"\n",null,"Chris Oliveiro graduated from the University of Toronto with a Bachelor of Science in Pharmacy degree. He started his career as a pharmacist working for Shoppers Drug Mart and later became Pharmacist-owner of 2 Shoppers Drug Mart stores in Mississauga. In 1995, Chris opened Springdale Pharmacy, an independent pharmacy in Brampton, Ontario. Today, he also owns and operates a second pharmacy, James Potter Road Pharmacy, also in Brampton. In 2016, Chris graduated with high honors from the University of Florida with a Pharm.D degree. He was also the recipient of the Outstanding Leadership Award in his graduating class. Chris is also a Certified Diabetes Educator and practices as a Clinical Pharmacist working closely with the doctors nearby his 2 stores to educate patients on diabetes and other diseases. As a Certified Diabetes Educator, Chris was shocked to learn that many of his patients with diabetes smoke tobacco. He became smoking-cessation certified and has a proven success record in helping many of his patients break the habit. He is an active member and a Vice-President of Pharmacists For A Smoke-Free Canada (PSFC). His wish for Ontario is to have a smoking cessation certified pharmacist available in all pharmacies. \n\n"]

{"sheet":"Information","index":10,"n_rows":58,"n_cols":36,"rows_kept":58,"cut":false,"hidden":true,"merged":[]}
["BRAND AND SIZE","PRICE PER PACK (C$)","# CIGS PER PACK",null,"Yearly expense","Years",null,"Store","Price Step 1 (14)",null,"Store","Price Step 1 (7)",null,"Store","Price Step 2 (7)",null,"Store","Price Step 3 (7)",null,"Store","Price Gum 4mg (105)",null,"Store","Price Gum 2mg (105)",null,"Store","Price Lozenge 4mg (88)",null,"Store","Price Lozenge 2mg (88)",null,"Store","Price Inhaler 4mg (42)",null,"Store","Price Quickmist (150)"]
["Patient unsure of costs",0,20,null,{"$f":"Results!C10*1","v":{"$error":"#DIV/0!"}},1,null,"Click here for drop-down options",0,null,"Click here for drop-down options",0,null,"Click here for drop-down options",0,null,"Click here for drop-down options",0,null,"Click here for drop-down options",0,null,"Click here for drop-down options",0,null,"Click here for drop-down options",0,null,"Click here for drop-down options",0,null,"Click here for drop-down options",0,null,"Click here for drop-down options",0]
["Premium 25 (one pack)",19.78,25,null,{"$f":"Results!C10*2","v":{"$error":"#DIV/0!"}},2,null,"Amazon",48.8,null,"Amazon",28.97,null,"Amazon",29.45,null,"Guardian/I.D.A./Remedy'sRx",34.99,null,"Amazon",33.97,null,"Amazon",33.97,null,"Independent Pharmacy",53.19,null,"Independent Pharmacy",53.19,null,"Amazon",33.97,null,"Amazon",29.97]
["Premium 25 (two packs)",33.619999999999997,50,null,{"$f":"Results!C10*3","v":{"$error":"#DIV/0!"}},3,null,"Guardian/I.D.A./Remedy'sRx",64.989999999999995,null,"Guardian/I.D.A./Remedy'sRx",34.99,null,"Guardian/I.D.A./Remedy'sRx",34.99,null,"Guardian/I.D.A./Remedy'sRx + Seniors' Day Discount (-20%)",27.99,null,"Guardian/I.D.A./Remedy'sRx",39.99,null,"Guardian/I.D.A./Remedy'sRx",39.99,null,"Pharmasave",42.99,null,"Pharmasave",47.99,null,"Guardian/I.D.A./Remedy'sRx",39.99,null,"Guardian/I.D.A./Remedy'sRx",39.99]
["Premium 25 (three packs)",42.375,75,null,{"$f":"Results!C10*4","v":{"$error":"#DIV/0!"}},4,null,"Guardian/I.D.A./Remedy'sRx + Seniors' Day Discount (-20%)",51.99,null,"Guardian/I.D.A./Remedy'sRx + Seniors' Day Discount (-20%)",27.99,null,"Guardian/I.D.A./Remedy'sRx + Seniors' Day Discount (-20%)",27.99,null,"Independent Pharmacy",29.99,null,"Guardian/I.D.A./Remedy'sRx + Seniors' Day Discount (-20%)",31.99,null,"Guardian/I.D.A./Remedy'sRx + Seniors' Day Discount (-20%)",31.99,null,"Rexall",43.99,null,"Rexall",43.99,null,"Guardian/I.D.A./Remedy'sRx + Seniors' Day Discount (-20%)",31.99,null,"Guardian/I.D.A./Remedy'sRx + Seniors' Day Discount (-20%)",31.99]
["Premium 20 (one pack)",15.42,20,null,{"$f":"Results!C10*5","v":{"$error":"#DIV/0!"}},5,null,"Independent Pharmacy",59.98,null,"Independent Pharmacy",29.99,null,"Independent Pharmacy",29.99,null,"Loblaws",31.99,null,"Independent Pharmacy",54.39,null,"Independent Pharmacy",54.39,null,"Rexall + Seniors' Day Discount (-20%)",35.19,null,"Rexall + Seniors' Day Discount (-20%)",35.19,null,"Independent Pharmacy",49,null,"Independent Pharmacy",49]
["Premium 20 (two packs)",28.54,40,null,{"$f":"Results!C10*6","v":{"$error":"#DIV/0!"}},6,null,"Loblaws",59.99,null,"Loblaws",31.99,null,"Loblaws",31.99,null,"Pharmasave",34.99,null,"Loblaws",37.99,null,"Loblaws",37.99,null,"Shoppers Drug Mart (SDM)",46.99,null,"Shoppers Drug Mart (SDM)",41.99,null,"Loblaws",37.99,null,"Loblaws",37.99]
["Non Premium 25 (one pack)",14.632999999999999,25,null,{"$f":"Results!C10*7","v":{"$error":"#DIV/0!"}},7,null,"Pharmasave",63.99,null,"Pharmasave",35.99,null,"Pharmasave",34.99,null,"Real Canadian Superstore",31.98,null,"Pharmasave",42.99,null,"Pharmasave",42.99,null,"SDM + Seniors' Day Discount (-20%)",37.590000000000003,null,"SDM + Seniors' Day Discount (-20%)",33.590000000000003,null,"Pharmasave",44.99,null,"Pharmasave",43.99]
["Non Premium 25 (two packs)",28.728000000000002,50,null,{"$f":"Results!C10*8","v":{"$error":"#DIV/0!"}},8,null,"Real Canadian Superstore",54.98,null,"Real Canadian Superstore",31.98,null,"Real Canadian Superstore",31.98,null,"Rexall",40.49,null,"Real Canadian Superstore",35.979999999999997,null,"Real Canadian Superstore",35.979999999999997,null,"Walmart",33.97,null,"Walmart",33.97,null,"Real Canadian Superstore",35.979999999999997,null,"Real Canadian Superstore",35.979999999999997]
["Non Premium 20 (one pack)",12.486499999999999,20,null,{"$f":"Results!C10*9","v":{"$error":"#DIV/0!"}},9,null,"Rexall",82.99,null,"Rexall",40.49,null,"Rexall",40.49,null,"Rexall + Seniors' Day Discount (-20%)",32.39,null,"Rexall",52.99,null,"Rexall",46.99,null,null,null,null,null,null,null,"Rexall",48.99,null,"Rexall",49.99]
{"$rows_left_out":48}