{"text_format":"1","workbook":"xlsx","n_sheets":9,"sheets":["Introduction","RAG Instructions","Dashboard","Risk Tracker","Staff","RAG Graph","Partner Data","Fee Earner Data","Sheet2"],"not_rendered":{"charts":5,"images":5,"macros":1,"external_links":0,"defined_names":4,"comments":0,"pivot_tables":7},"unopened":[],"bounds":{"document_bytes":16777216,"sheet_cells":100000,"rows_first":2000,"rows_last":500,"rows_between":2000,"halvings":0,"cell_chars":16384,"cell_head_chars":4096},"cells_cut":0,"cells_raw":0,"read":"whole","date_system":"1900"}

{"sheet":"Introduction","index":0,"n_rows":22,"n_cols":1,"rows_kept":22,"cut":false,"hidden":false,"merged":[[1,0,1,9],[15,0,15,9],[16,0,16,9],[20,0,20,9],[21,0,21,9],[4,0,10,9],[11,0,11,9],[3,0,3,9],[12,0,12,9],[13,0,13,9],[14,0,14,9],[17,0,17,9],[18,0,18,9]]}
[]
["Risk Tracker Introduction"]
[]
["Introduction"]
["Welcome to the risk tracker. You can use this document to identify, track and mitigate risks associated with client matters. \n\nMost matters you deal with will be straightforward and won’t need to be entered onto the tracker but where unusual or tricky issues arise this is a great means by which you can log and track those “red flag”, high risk matters to ensure they reach a satisfactory conclusion.\n\nAs you can see, there are five tabs at the bottom of this document – \n        • Introduction\n        • Risk Tracker\n        • Dashboard\n        • RAG Instructions\n        • Staff\n\nThis is the introduction page. You can click on each of the labels to move from section to section.\n\nPlease note there is no print functionality built into this spreadsheet.\n"]
[]
[]
[]
[]
[]
[]
["RAG Instructions"]
["Click on the “RAG Instructions” tabs.\n\nWhen you identify a risk, you should grade it based on the likelihood and seriousness of its impact or its overall effect on the client or the firm.\n\nBy following the instructions on this page, you can give each of the issues included on the tracker a RAG rating (Red, Amber or Green) so that they can be prioritised. You can do this by assessing the risk in terms of:\n        • How likely it is that things will go wrong (likelihood) \n        • What the impact of this will be if things do go wrong (severity)\n"]
["Dashboard"]
["Click on the “Dashboard” tabs.\n\nThe dashboard provides summary information which allows you to monitor all of the risks that have been logged, tracking the number of open and closed risks, the risk review date and more.\n\nClicking on the “Refresh” button on this page will automatically update the dashboard to reflect any changes that you have made on the “Risk Tracker” page.\n\nWithin the dashboard page you can click on the         and         icons on the left hand side of the tables to expand them and drill down into specifics.\n\nOn the dashboard page, there are graphs and charts which will give you a visual and easily digestible look at the risks and the key people involved. Returning to this page is a useful way to stay on top of all the risks that have been identified and know where you have to prioritise your efforts in resolving or mitigating these risks.\n"]
["Risk Tracker"]
["Clicking on the “Risk Tracker” tabs will take you to the main page of the document, where you record your risk information. \n\nThe table can be used to detail any issues or high risks involved with any client matter and you can update it regularly to keep track of new risks, your progress on existing risks and the key team members and partners involved in dealing with the issues.\n\nSome of the text in the tracker is quite small so please use the zoom function at the bottom right of your screen to expand the text size. This will be particuarly useful when selecting fee earners and partners information.\n\nWhat is included in the table?\n\nThe table includes many key components. You can use the table to outline potential risks associated with client matters. There are columns for:\n        • The matter (or file) number\n        • A description of the client matter\n        • Open / closed (depending on whether the risk / issue has been resolved)\n        • A description of the risk and the issue \n        • RAG rating – see RAG instructions below\n        • Date updated\n        • Progress to date\n        • Mitigations / next steps\n        • Responsible fee earner\n        • Responsible partner\n        • Responsible partner’s comments\n        • Next review – to flag up imminent reviews, these boxes will automatically turn amber on the day before the review date. The box will turn red on the day after the review, \n           prompting you to amend the date once the review has been held.\n"]
["Staff"]
["\nClick on the “Staff” tab. \n\nUse this page to list all of the solicitors within the firm or the relevant department who might be working on matters.\nEach solicitor can be tagged as either “Partner” or “Fee Earner”. \nOnce you have listed the solicitors, click the \"Update Staff\" button on the right hand side. \nYou will then be able to choose these solicitors from the “Responsible partner” and “Responsible fee earner” drop down menus on the Risk Tracker tab.\n\nYou can amend, add or remove solicitors at any time but always remember to go back to the Staff tab to hit “Update Staff” after you have done so.\n"]
[]
["Feedback"]
["We are keen to receive feedback and we would love to hear your views on the risk tracker and its usefulness. If you have any suggested amendments, we’d be happy to consider those."]

{"sheet":"RAG Instructions","index":1,"n_rows":34,"n_cols":7,"rows_kept":34,"cut":false,"hidden":false,"merged":[[15,1,15,11],[6,1,6,11],[7,1,7,11],[9,2,9,3],[9,4,9,11],[10,2,10,3],[10,4,10,11],[11,2,11,3],[11,4,11,11],[12,2,12,3],[12,4,12,11],[14,1,14,11],[33,1,33,2],[33,3,33,5],[33,6,33,11],[30,1,30,2],[30,3,30,5],[30,6,30,11],[31,1,31,2],[31,3,31,5],[31,6,31,11],[5,1,5,11],[32,1,32,2],[32,3,32,5],[32,6,32,11],[29,1,29,11],[17,2,17,3],[17,4,17,11],[18,2,18,3],[18,4,18,11],[19,2,19,3],[19,4,19,11],[20,2,20,3],[20,4,20,11],[22,1,22,4],[23,1,24,1],[23,2,23,4]]}
[]
[]
[]
[]
[]
[null,"Assigning a RAG Status"]
[null,"Likelihood"]
[null,"Rate the chance of the risk occuring if no mitigation is taken"]
[]
[null,"Score","Description",null,"Definition"]
[null,1,"Unlikely to occur",null,"Typically occurs less than once every 5 years"]
[null,2,"Likely to occur",null,"Typically occurs more than once ever 5 years but less than once per year"]
[null,3,"Near certainty to occur",null,"Typically occurs more than once per year"]
[]
[null,"Severity"]
[null,"Rate the impact of the risk if it occurs an no mitigation is taken"]
[]
[null,"Score","Description",null,"Definition"]
[null,1,"Low impact ",null,"Minor time or financial impact. No client relationship impact."]
[null,2,"Medium impact",null,"Substantial financial, time or client relationship impact"]
[null,3,"Severe impact",null,"Business critical financial or relationship impact"]
[]
[null,"RAG Assessment"]
[null,"Likelihood","Severity"]
[null,null,1,2,3]
[null,1,2,3,4]
[null,2,3,4,5]
[null,3,4,5,6]
[]
[null,"Risk Category Descriptions and Actions"]
[null,"Risk Category",null,"Description",null,null,"Action"]
[null,"Red",null,"Unnacceptable risk",null,null,"Inform Head of Department"]
[null,"Amber ",null,"Risk acceptable with mitigations",null,null,"Inform Responsible Partner"]
[null,"Green",null,"Acceptable risk",null,null,"No action required. Document risk management decisions. "]

{"sheet":"Dashboard","index":2,"n_rows":9,"n_cols":41,"rows_kept":9,"cut":false,"hidden":false,"merged":[[1,21,1,27],[1,3,1,10],[1,12,1,19],[1,39,1,45],[1,29,1,37]]}
[]
[null,null,null,"Summary of Open/Closed Risks",null,null,null,null,null,null,null,null,"Risk Review Due Date",null,null,null,null,null,null,null,null,"Summary per RAG Rating",null,null,null,null,null,null,null,"Summary per Partner",null,null,null,null,null,null,null,null,null,"Summary per Fee Earner"]
[]
[null,null,null,"ID",1,null,"ID",1,null,null,null,null,"ID",1,null,"ID",1,null,null,null,null,"ID",1]
[null,null,null,null,null,null,null,null,null,null,null,null,null,null,null,null,null,null,null,null,null,null,null,null,null,null,null,null,null,"ID",1,null,null,null,null,null,null,null,null,"ID",1]
[null,null,null,"Row Labels","No. Matters",null,"Row Labels","No. Matters",null,null,null,null,"Row Labels","No. Matters",null,"Row Labels","No. Matters",null,null,null,null,"Row Labels","No. Matters"]
[null,null,null,"(blank)",null,null,"(blank)",{"$error":"#DIV/0!"},null,null,null,null,"(blank)",null,null,"(blank)",null,null,null,null,null,"(blank)",null,null,null,null,null,null,null,"Row Labels","No. Matters",null,null,null,null,null,null,null,null,"Row Labels","Count of Matter Name"]
[null,null,null,"Grand Total",null,null,"Grand Total",{"$error":"#DIV/0!"},null,null,null,null,"Grand Total",null,null,"Grand Total",null,null,null,null,null,"Grand Total",null,null,null,null,null,null,null,"(blank)",null,null,null,null,null,null,null,null,null,"(blank)"]
[null,null,null,null,null,null,null,null,null,null,null,null,null,null,null,null,null,null,null,null,null,null,null,null,null,null,null,null,null,"Grand Total",null,null,null,null,null,null,null,null,null,"Grand Total"]

{"sheet":"Risk Tracker","index":3,"n_rows":1000,"n_cols":16,"rows_kept":1000,"cut":false,"hidden":false,"merged":[[1,11,2,11],[1,15,2,15],[1,1,2,1],[0,1,0,14],[1,14,2,14],[1,4,2,4],[1,6,2,6],[1,12,2,12],[1,13,2,13],[1,8,2,8],[1,7,2,7],[1,10,2,10],[1,5,2,5],[1,3,2,3],[1,2,2,2],[1,9,2,9]]}
[null,"RISKS AND ISSUES TRACKER - BLOGGS & CO"]
[null,"Risk No","Matter Number","Matter Name","Description","Open/Closed Risks","Risks and Issues Description","RAG Rating","Date Updated","Progress to Date","Mitigations / Next Steps","Responsible Fee Earner","Responsible Partner","Responsible Partner Comments","Next Review Date","ID"]
[]
[null,1,null,null,null,null,null,null,null,null,null,null,null,null,null,{"$f":"IF(B4>0,1,0)","v":1}]
[null,null,null,null,null,null,null,null,null,null,null,null,null,null,null,{"$f":"IF(B5>0,1,0)","v":0}]
[null,null,null,null,null,null,null,null,null,null,null,null,null,null,null,0]
[null,null,null,null,null,null,null,null,null,null,null,null,null,null,null,0]
[null,null,null,null,null,null,null,null,null,null,null,null,null,null,null,0]
[null,null,null,null,null,null,null,null,null,null,null,null,null,null,null,0]
[null,null,null,null,null,null,null,null,null,null,null,null,null,null,null,0]
[null,null,null,null,null,null,null,null,null,null,null,null,null,null,null,0]
[null,null,null,null,null,null,null,null,null,null,null,null,null,null,null,0]
[null,null,null,null,null,null,null,null,null,null,null,null,null,null,null,0]
[null,null,null,null,null,null,null,null,null,null,null,null,null,null,null,0]
[null,null,null,null,null,null,null,null,null,null,null,null,null,null,null,0]
[null,null,null,null,null,null,null,null,null,null,null,null,null,null,null,0]
[null,null,null,null,null,null,null,null,null,null,null,null,null,null,null,0]
[null,null,null,null,null,null,null,null,null,null,null,null,null,null,null,0]
[null,null,null,null,null,null,null,null,null,null,null,null,null,null,null,0]
[null,null,null,null,null,null,null,null,null,null,null,null,null,null,null,0]
[null,null,null,null,null,null,null,null,null,null,null,null,null,null,null,0]
[null,null,null,null,null,null,null,null,null,null,null,null,null,null,null,0]
[null,null,null,null,null,null,null,null,null,null,null,null,null,null,null,0]
[null,null,null,null,null,null,null,null,null,null,null,null,null,null,null,0]
[null,null,null,null,null,null,null,null,null,null,null,null,null,null,null,0]
[null,null,null,null,null,null,null,null,null,null,null,null,null,null,null,0]
[null,null,null,null,null,null,null,null,null,null,null,null,null,null,null,0]
[null,null,null,null,null,null,null,null,null,null,null,null,null,null,null,0]
[null,null,null,null,null,null,null,null,null,null,null,null,null,null,null,0]
[null,null,null,null,null,null,null,null,null,null,null,null,null,null,null,0]
[null,null,null,null,null,null,null,null,null,null,null,null,null,null,null,0]
[null,null,null,null,null,null,null,null,null,null,null,null,null,null,null,0]
[null,null,null,null,null,null,null,null,null,null,null,null,null,null,null,0]
[null,null,null,null,null,null,null,null,null,null,null,null,null,null,null,0]
[null,null,null,null,null,null,null,null,null,null,null,null,null,null,null,0]
[null,null,null,null,null,null,null,null,null,null,null,null,null,null,null,0]
[null,null,null,null,null,null,null,null,null,null,null,null,null,null,null,0]
[null,null,null,null,null,null,null,null,null,null,null,null,null,null,null,0]
[null,null,null,null,null,null,null,null,null,null,null,null,null,null,null,0]
[null,null,null,null,null,null,null,null,null,null,null,null,null,null,null,0]
[null,null,null,null,null,null,null,null,null,null,null,null,null,null,null,0]
[null,null,null,null,null,null,null,null,null,null,null,null,null,null,null,0]
[null,null,null,null,null,null,null,null,null,null,null,null,null,null,null,0]
[null,null,null,null,null,null,null,null,null,null,null,null,null,null,null,0]
[null,null,null,null,null,null,null,null,null,null,null,null,null,null,null,0]
[null,null,null,null,null,null,null,null,null,null,null,null,null,null,null,0]
[null,null,null,null,null,null,null,null,null,null,null,null,null,null,null,0]
[null,null,null,null,null,null,null,null,null,null,null,null,null,null,null,0]
[null,null,null,null,null,null,null,null,null,null,null,null,null,null,null,0]
[null,null,null,null,null,null,null,null,null,null,null,null,null,null,null,0]
[null,null,null,null,null,null,null,null,null,null,null,null,null,null,null,0]
[null,null,null,null,null,null,null,null,null,null,null,null,null,null,null,0]
[null,null,null,null,null,null,null,null,null,null,null,null,null,null,null,0]
[null,null,null,null,null,null,null,null,null,null,null,null,null,null,null,0]
[null,null,null,null,null,null,null,null,null,null,null,null,null,null,null,0]
[null,null,null,null,null,null,null,null,null,null,null,null,null,null,null,0]
[null,null,null,null,null,null,null,null,null,null,null,null,null,null,null,0]
[null,null,null,null,null,null,null,null,null,null,null,null,null,null,null,0]
[null,null,null,null,null,null,null,null,null,null,null,null,null,null,null,0]
[null,null,null,null,null,null,null,null,null,null,null,null,null,null,null,0]
{"$rows_left_out":941}
{"sheet":"Staff","index":4,"n_rows":1,"n_cols":2,"rows_kept":1,"cut":false,"hidden":false,"merged":[]}
["Name","Partner/Fee Earner"]

{"sheet":"RAG Graph","index":5,"n_rows":4,"n_cols":2,"rows_kept":4,"cut":false,"hidden":true,"merged":[]}
["Status","No. Matters"]
["Red",{"$f":"COUNTIF('Risk Tracker'!$H$4:$H$1003,'RAG Graph'!A2)","v":0}]
["Amber",{"$f":"COUNTIF('Risk Tracker'!$H$4:$H$1003,'RAG Graph'!A3)","v":0}]
["Green",{"$f":"COUNTIF('Risk Tracker'!$H$4:$H$1003,'RAG Graph'!A4)","v":0}]

{"sheet":"Partner Data","index":6,"n_rows":1000,"n_cols":7,"rows_kept":1000,"cut":false,"hidden":true,"merged":[]}
["Name","Partner/Fee Earner","Total",null,null,null,"Partner"]
[null,null,{"$f":"COUNTIF('Risk Tracker'!$M$4:$M$1003,'Partner Data'!A2)","v":0},null,null,null,"Fee Earner"]
[null,null,{"$f":"COUNTIF('Risk Tracker'!$M$4:$M$1003,'Partner Data'!A3)","v":0}]
[null,null,{"$f":"COUNTIF('Risk Tracker'!$M$4:$M$1003,'Partner Data'!A4)","v":0}]
[null,null,{"$f":"COUNTIF('Risk Tracker'!$M$4:$M$1003,'Partner Data'!A5)","v":0}]
[null,null,{"$f":"COUNTIF('Risk Tracker'!$M$4:$M$1003,'Partner Data'!A6)","v":0}]
[null,null,{"$f":"COUNTIF('Risk Tracker'!$M$4:$M$1003,'Partner Data'!A7)","v":0}]
[null,null,{"$f":"COUNTIF('Risk Tracker'!$M$4:$M$1003,'Partner Data'!A8)","v":0}]
[null,null,{"$f":"COUNTIF('Risk Tracker'!$M$4:$M$1003,'Partner Data'!A9)","v":0}]
[null,null,{"$f":"COUNTIF('Risk Tracker'!$M$4:$M$1003,'Partner Data'!A10)","v":0}]
[null,null,{"$f":"COUNTIF('Risk Tracker'!$M$4:$M$1003,'Partner Data'!A11)","v":0}]
[null,null,{"$f":"COUNTIF('Risk Tracker'!$M$4:$M$1003,'Partner Data'!A12)","v":0}]
[null,null,{"$f":"COUNTIF('Risk Tracker'!$M$4:$M$1003,'Partner Data'!A13)","v":0}]
[null,null,{"$f":"COUNTIF('Risk Tracker'!$M$4:$M$1003,'Partner Data'!A14)","v":0}]
[null,null,{"$f":"COUNTIF('Risk Tracker'!$M$4:$M$1003,'Partner Data'!A15)","v":0}]
[null,null,{"$f":"COUNTIF('Risk Tracker'!$M$4:$M$1003,'Partner Data'!A16)","v":0}]
[null,null,{"$f":"COUNTIF('Risk Tracker'!$M$4:$M$1003,'Partner Data'!A17)","v":0}]
[null,null,{"$f":"COUNTIF('Risk Tracker'!$M$4:$M$1003,'Partner Data'!A18)","v":0}]
[null,null,{"$f":"COUNTIF('Risk Tracker'!$M$4:$M$1003,'Partner Data'!A19)","v":0}]
[null,null,{"$f":"COUNTIF('Risk Tracker'!$M$4:$M$1003,'Partner Data'!A20)","v":0}]
[null,null,{"$f":"COUNTIF('Risk Tracker'!$M$4:$M$1003,'Partner Data'!A21)","v":0}]
[null,null,{"$f":"COUNTIF('Risk Tracker'!$M$4:$M$1003,'Partner Data'!A22)","v":0}]
[null,null,{"$f":"COUNTIF('Risk Tracker'!$M$4:$M$1003,'Partner Data'!A23)","v":0}]
[null,null,{"$f":"COUNTIF('Risk Tracker'!$M$4:$M$1003,'Partner Data'!A24)","v":0}]
[null,null,{"$f":"COUNTIF('Risk Tracker'!$M$4:$M$1003,'Partner Data'!A25)","v":0}]
[null,null,{"$f":"COUNTIF('Risk Tracker'!$M$4:$M$1003,'Partner Data'!A26)","v":0}]
[null,null,{"$f":"COUNTIF('Risk Tracker'!$M$4:$M$1003,'Partner Data'!A27)","v":0}]
[null,null,{"$f":"COUNTIF('Risk Tracker'!$M$4:$M$1003,'Partner Data'!A28)","v":0}]
[null,null,{"$f":"COUNTIF('Risk Tracker'!$M$4:$M$1003,'Partner Data'!A29)","v":0}]
[null,null,{"$f":"COUNTIF('Risk Tracker'!$M$4:$M$1003,'Partner Data'!A30)","v":0}]
[null,null,{"$f":"COUNTIF('Risk Tracker'!$M$4:$M$1003,'Partner Data'!A31)","v":0}]
[null,null,{"$f":"COUNTIF('Risk Tracker'!$M$4:$M$1003,'Partner Data'!A32)","v":0}]
[null,null,{"$f":"COUNTIF('Risk Tracker'!$M$4:$M$1003,'Partner Data'!A33)","v":0}]
[null,null,{"$f":"COUNTIF('Risk Tracker'!$M$4:$M$1003,'Partner Data'!A34)","v":0}]
[null,null,{"$f":"COUNTIF('Risk Tracker'!$M$4:$M$1003,'Partner Data'!A35)","v":0}]
[null,null,{"$f":"COUNTIF('Risk Tracker'!$M$4:$M$1003,'Partner Data'!A36)","v":0}]
[null,null,{"$f":"COUNTIF('Risk Tracker'!$M$4:$M$1003,'Partner Data'!A37)","v":0}]
[null,null,{"$f":"COUNTIF('Risk Tracker'!$M$4:$M$1003,'Partner Data'!A38)","v":0}]
[null,null,{"$f":"COUNTIF('Risk Tracker'!$M$4:$M$1003,'Partner Data'!A39)","v":0}]
[null,null,{"$f":"COUNTIF('Risk Tracker'!$M$4:$M$1003,'Partner Data'!A40)","v":0}]
[null,null,{"$f":"COUNTIF('Risk Tracker'!$M$4:$M$1003,'Partner Data'!A41)","v":0}]
[null,null,{"$f":"COUNTIF('Risk Tracker'!$M$4:$M$1003,'Partner Data'!A42)","v":0}]
[null,null,{"$f":"COUNTIF('Risk Tracker'!$M$4:$M$1003,'Partner Data'!A43)","v":0}]
[null,null,{"$f":"COUNTIF('Risk Tracker'!$M$4:$M$1003,'Partner Data'!A44)","v":0}]
[null,null,{"$f":"COUNTIF('Risk Tracker'!$M$4:$M$1003,'Partner Data'!A45)","v":0}]
[null,null,{"$f":"COUNTIF('Risk Tracker'!$M$4:$M$1003,'Partner Data'!A46)","v":0}]
[null,null,{"$f":"COUNTIF('Risk Tracker'!$M$4:$M$1003,'Partner Data'!A47)","v":0}]
[null,null,{"$f":"COUNTIF('Risk Tracker'!$M$4:$M$1003,'Partner Data'!A48)","v":0}]
[null,null,{"$f":"COUNTIF('Risk Tracker'!$M$4:$M$1003,'Partner Data'!A49)","v":0}]
[null,null,{"$f":"COUNTIF('Risk Tracker'!$M$4:$M$1003,'Partner Data'!A50)","v":0}]
[null,null,{"$f":"COUNTIF('Risk Tracker'!$M$4:$M$1003,'Partner Data'!A51)","v":0}]
[null,null,{"$f":"COUNTIF('Risk Tracker'!$M$4:$M$1003,'Partner Data'!A52)","v":0}]
[null,null,{"$f":"COUNTIF('Risk Tracker'!$M$4:$M$1003,'Partner Data'!A53)","v":0}]
[null,null,{"$f":"COUNTIF('Risk Tracker'!$M$4:$M$1003,'Partner Data'!A54)","v":0}]
[null,null,{"$f":"COUNTIF('Risk Tracker'!$M$4:$M$1003,'Partner Data'!A55)","v":0}]
[null,null,{"$f":"COUNTIF('Risk Tracker'!$M$4:$M$1003,'Partner Data'!A56)","v":0}]
[null,null,{"$f":"COUNTIF('Risk Tracker'!$M$4:$M$1003,'Partner Data'!A57)","v":0}]
[null,null,{"$f":"COUNTIF('Risk Tracker'!$M$4:$M$1003,'Partner Data'!A58)","v":0}]
[null,null,{"$f":"COUNTIF('Risk Tracker'!$M$4:$M$1003,'Partner Data'!A59)","v":0}]
[null,null,{"$f":"COUNTIF('Risk Tracker'!$M$4:$M$1003,'Partner Data'!A60)","v":0}]
{"$rows_left_out":941}
{"sheet":"Fee Earner Data","index":7,"n_rows":1000,"n_cols":3,"rows_kept":1000,"cut":false,"hidden":true,"merged":[]}
["Name","Partner/Fee Earner","Total"]
[null,null,{"$f":"COUNTIF('Risk Tracker'!$L$4:$L$1003,'Fee Earner Data'!A2)","v":0}]
[null,null,{"$f":"COUNTIF('Risk Tracker'!$L$4:$L$1003,'Fee Earner Data'!A3)","v":0}]
[null,null,{"$f":"COUNTIF('Risk Tracker'!$L$4:$L$1003,'Fee Earner Data'!A4)","v":0}]
[null,null,{"$f":"COUNTIF('Risk Tracker'!$L$4:$L$1003,'Fee Earner Data'!A5)","v":0}]
[null,null,{"$f":"COUNTIF('Risk Tracker'!$L$4:$L$1003,'Fee Earner Data'!A6)","v":0}]
[null,null,{"$f":"COUNTIF('Risk Tracker'!$L$4:$L$1003,'Fee Earner Data'!A7)","v":0}]
[null,null,{"$f":"COUNTIF('Risk Tracker'!$L$4:$L$1003,'Fee Earner Data'!A8)","v":0}]
[null,null,{"$f":"COUNTIF('Risk Tracker'!$L$4:$L$1003,'Fee Earner Data'!A9)","v":0}]
[null,null,{"$f":"COUNTIF('Risk Tracker'!$L$4:$L$1003,'Fee Earner Data'!A10)","v":0}]
[null,null,{"$f":"COUNTIF('Risk Tracker'!$L$4:$L$1003,'Fee Earner Data'!A11)","v":0}]
[null,null,{"$f":"COUNTIF('Risk Tracker'!$L$4:$L$1003,'Fee Earner Data'!A12)","v":0}]
[null,null,{"$f":"COUNTIF('Risk Tracker'!$L$4:$L$1003,'Fee Earner Data'!A13)","v":0}]
[null,null,{"$f":"COUNTIF('Risk Tracker'!$L$4:$L$1003,'Fee Earner Data'!A14)","v":0}]
[null,null,{"$f":"COUNTIF('Risk Tracker'!$L$4:$L$1003,'Fee Earner Data'!A15)","v":0}]
[null,null,{"$f":"COUNTIF('Risk Tracker'!$L$4:$L$1003,'Fee Earner Data'!A16)","v":0}]
[null,null,{"$f":"COUNTIF('Risk Tracker'!$L$4:$L$1003,'Fee Earner Data'!A17)","v":0}]
[null,null,{"$f":"COUNTIF('Risk Tracker'!$L$4:$L$1003,'Fee Earner Data'!A18)","v":0}]
[null,null,{"$f":"COUNTIF('Risk Tracker'!$L$4:$L$1003,'Fee Earner Data'!A19)","v":0}]
[null,null,{"$f":"COUNTIF('Risk Tracker'!$L$4:$L$1003,'Fee Earner Data'!A20)","v":0}]
[null,null,{"$f":"COUNTIF('Risk Tracker'!$L$4:$L$1003,'Fee Earner Data'!A21)","v":0}]
[null,null,{"$f":"COUNTIF('Risk Tracker'!$L$4:$L$1003,'Fee Earner Data'!A22)","v":0}]
[null,null,{"$f":"COUNTIF('Risk Tracker'!$L$4:$L$1003,'Fee Earner Data'!A23)","v":0}]
[null,null,{"$f":"COUNTIF('Risk Tracker'!$L$4:$L$1003,'Fee Earner Data'!A24)","v":0}]
[null,null,{"$f":"COUNTIF('Risk Tracker'!$L$4:$L$1003,'Fee Earner Data'!A25)","v":0}]
[null,null,{"$f":"COUNTIF('Risk Tracker'!$L$4:$L$1003,'Fee Earner Data'!A26)","v":0}]
[null,null,{"$f":"COUNTIF('Risk Tracker'!$L$4:$L$1003,'Fee Earner Data'!A27)","v":0}]
[null,null,{"$f":"COUNTIF('Risk Tracker'!$L$4:$L$1003,'Fee Earner Data'!A28)","v":0}]
[null,null,{"$f":"COUNTIF('Risk Tracker'!$L$4:$L$1003,'Fee Earner Data'!A29)","v":0}]
[null,null,{"$f":"COUNTIF('Risk Tracker'!$L$4:$L$1003,'Fee Earner Data'!A30)","v":0}]
[null,null,{"$f":"COUNTIF('Risk Tracker'!$L$4:$L$1003,'Fee Earner Data'!A31)","v":0}]
[null,null,{"$f":"COUNTIF('Risk Tracker'!$L$4:$L$1003,'Fee Earner Data'!A32)","v":0}]
[null,null,{"$f":"COUNTIF('Risk Tracker'!$L$4:$L$1003,'Fee Earner Data'!A33)","v":0}]
[null,null,{"$f":"COUNTIF('Risk Tracker'!$L$4:$L$1003,'Fee Earner Data'!A34)","v":0}]
[null,null,{"$f":"COUNTIF('Risk Tracker'!$L$4:$L$1003,'Fee Earner Data'!A35)","v":0}]
[null,null,{"$f":"COUNTIF('Risk Tracker'!$L$4:$L$1003,'Fee Earner Data'!A36)","v":0}]
[null,null,{"$f":"COUNTIF('Risk Tracker'!$L$4:$L$1003,'Fee Earner Data'!A37)","v":0}]
[null,null,{"$f":"COUNTIF('Risk Tracker'!$L$4:$L$1003,'Fee Earner Data'!A38)","v":0}]
[null,null,{"$f":"COUNTIF('Risk Tracker'!$L$4:$L$1003,'Fee Earner Data'!A39)","v":0}]
[null,null,{"$f":"COUNTIF('Risk Tracker'!$L$4:$L$1003,'Fee Earner Data'!A40)","v":0}]
[null,null,{"$f":"COUNTIF('Risk Tracker'!$L$4:$L$1003,'Fee Earner Data'!A41)","v":0}]
[null,null,{"$f":"COUNTIF('Risk Tracker'!$L$4:$L$1003,'Fee Earner Data'!A42)","v":0}]
[null,null,{"$f":"COUNTIF('Risk Tracker'!$L$4:$L$1003,'Fee Earner Data'!A43)","v":0}]
[null,null,{"$f":"COUNTIF('Risk Tracker'!$L$4:$L$1003,'Fee Earner Data'!A44)","v":0}]
[null,null,{"$f":"COUNTIF('Risk Tracker'!$L$4:$L$1003,'Fee Earner Data'!A45)","v":0}]
[null,null,{"$f":"COUNTIF('Risk Tracker'!$L$4:$L$1003,'Fee Earner Data'!A46)","v":0}]
[null,null,{"$f":"COUNTIF('Risk Tracker'!$L$4:$L$1003,'Fee Earner Data'!A47)","v":0}]
[null,null,{"$f":"COUNTIF('Risk Tracker'!$L$4:$L$1003,'Fee Earner Data'!A48)","v":0}]
[null,null,{"$f":"COUNTIF('Risk Tracker'!$L$4:$L$1003,'Fee Earner Data'!A49)","v":0}]
[null,null,{"$f":"COUNTIF('Risk Tracker'!$L$4:$L$1003,'Fee Earner Data'!A50)","v":0}]
[null,null,{"$f":"COUNTIF('Risk Tracker'!$L$4:$L$1003,'Fee Earner Data'!A51)","v":0}]
[null,null,{"$f":"COUNTIF('Risk Tracker'!$L$4:$L$1003,'Fee Earner Data'!A52)","v":0}]
[null,null,{"$f":"COUNTIF('Risk Tracker'!$L$4:$L$1003,'Fee Earner Data'!A53)","v":0}]
[null,null,{"$f":"COUNTIF('Risk Tracker'!$L$4:$L$1003,'Fee Earner Data'!A54)","v":0}]
[null,null,{"$f":"COUNTIF('Risk Tracker'!$L$4:$L$1003,'Fee Earner Data'!A55)","v":0}]
[null,null,{"$f":"COUNTIF('Risk Tracker'!$L$4:$L$1003,'Fee Earner Data'!A56)","v":0}]
[null,null,{"$f":"COUNTIF('Risk Tracker'!$L$4:$L$1003,'Fee Earner Data'!A57)","v":0}]
[null,null,{"$f":"COUNTIF('Risk Tracker'!$L$4:$L$1003,'Fee Earner Data'!A58)","v":0}]
[null,null,{"$f":"COUNTIF('Risk Tracker'!$L$4:$L$1003,'Fee Earner Data'!A59)","v":0}]
[null,null,{"$f":"COUNTIF('Risk Tracker'!$L$4:$L$1003,'Fee Earner Data'!A60)","v":0}]
{"$rows_left_out":941}
{"sheet":"Sheet2","index":8,"n_rows":3,"n_cols":3,"rows_kept":3,"cut":false,"hidden":true,"merged":[]}
["Red",null,"Open"]
["Amber",null,"Closed"]
["Green"]